Aschrack Vive Pen² | Bien, j'ai donc pu compléter l'install sans que ça crash (mais avec un écran tout mauve tout pourri etc...) avec des vesa
jme suis dit, si j'arrive à faire ça hop j'install ensuite les drivers proprio
eh ben c'était trop espérer
j'ai fait donc cela, pis j'ai suivi le guide de Dark Schneider (sur linux-wizard) qui, et je l'en remercie, m'a déja servi et n'a jamais failli (même sur ce pc ci)
j'ai téléchargé les drivers, la dernière version
et là, paf la tnt2 n'es tplus supportée, on me dit de prendre les legacy
je cherche sur le site, bien sûr il n'y sont indiqué nulle part tel que "legacy"
cherchant un peu j'apprend qu'en fait, suffit de prendre de vieux drivers, no prob, c'est un pc just epour faire du traitement de texte et surfer sur le net, les perfs 3D on s'en tape royalement, je reprend donc alors les 6111 que j'ai déja pu installer plus d'une fois avec grand succès sur cette machine mais avec des versions précédentes de la mandriva, mandrake à l'époque
et là paf, ce que jamais je n'avais eu
1°) blabla pas d'interface précompilée pour le kernel
download? oui > trouve pas
no problem, on compile à ce moment
2°) ouiiiiiiiiiiiiiin y'a les rivafb d'installé, ça marchera pas mais je crée kan même le module
moi> euh ok fait donc mon ami, je tenterai de trouver de quoi tu me parles ensuite pis je virerai l'intrus qui ne te plais pas
3°) bam error, go see the log et pis ça se fini là
le log étant le suviant
Citation :
nvidia-installer log file '/var/log/nvidia-installer.log'
creation time: Tue Dec 27 00:32:17 2005
option status:
license pre-accepted : false
update : false
force update : false
expert : false
uninstall : false
driver info : false
no precompiled interface: false
no ncurses color : false
query latest driver ver : false
OpenGL header files : false
no questions : false
silent : false
X install prefix : /usr/X11R6
OpenGL install prefix : /usr
Installer install prefix: /usr
kernel source path : (not specified)
kernel install path : (not specified)
proc mount point : /proc
ui : (not specified)
tmpdir : /root/tmp
ftp site : ftp://download.nvidia.com
Using: nvidia-installer ncurses user interface
-> License accepted.
-> No precompiled kernel interface was found to match your kernel; would you li
ke the installer to attempt to download a kernel interface for your kernel f
rom the NVIDIA ftp site (ftp://download.nvidia.com)? (Answer: No)
-> No precompiled kernel interface was found to match your kernel; this means
that the installer will need to compile a new kernel interface.
-> Kernel source path: '/lib/modules/2.6.12-12mdk/build'
-> Performing cc_version_check with CC="cc".
-> Performing rivafb check.
-> Performing rivafb module check.
WARNING: Your kernel was configured to include rivafb support as
a loadable kernel module.
The rivafb driver conflicts with the NVIDIA driver; the
NVIDIA kernel module will still be built and installed,
but be aware that the NVIDIA driver will not be able to
function properly if the rivafb module is loaded!
-> Cleaning kernel module build directory.
executing: 'cd ./usr/src/nv; make clean'...
rm -f -f nv.o os-agp.o os-interface.o os-registry.o nv.o os-agp.o os-interfa
ce.o os-registry.o nvidia.mod.o
rm -f -f build-in.o nv-linux.o *.d .*.{cmd,flags}
rm -f -f nvidia.{o,ko,mod.{o,c}} nv_compiler.h *~
-> Building kernel module:
executing: 'cd ./usr/src/nv; make module SYSSRC=/lib/modules/2.6.12-12mdk/bu
ild SYSOUT=/lib/modules/2.6.12-12mdk/build'...
Your kernel was configured to include rivafb support as
a loadable kernel module.
The rivafb driver conflicts with the NVIDIA driver; the
NVIDIA kernel module will still be built and installed,
but be aware that the NVIDIA driver will not be able to
function properly if the rivafb module is loaded!
*** Failed rivafb module sanity check, but continuing! ***
NVIDIA: calling KBUILD...
make -C /lib/modules/2.6.12-12mdk/build \
KBUILD_SRC=/usr/src/linux-2.6.12-12mdk KBUILD_VERBOSE=1 \
KBUILD_CHECK= KBUILD_EXTMOD="/root/tmp/selfgz6313/NVIDIA-Linux-x86-1.0-6111-
pkg1/usr/src/nv" \
-f /usr/src/linux-2.6.12-12mdk/Makefile modules
mkdir -p /root/tmp/selfgz6313/NVIDIA-Linux-x86-1.0-6111-pkg1/usr/src/nv/.tmp
_versions
WARNING: Symbol version dump /usr/src/linux-2.6.12-12mdk/Module.symvers
is missing; modules will have no dependencies and modversions.
make -f /usr/src/linux-2.6.12-12mdk/scripts/Makefile.build obj=/root/tmp/sel
fgz6313/NVIDIA-Linux-x86-1.0-6111-pkg1/usr/src/nv
echo \#define NV_COMPILER \"`cc -v 2>&1 | tail -n 1`\" > /root/tmp/selfgz631
3/NVIDIA-Linux-x86-1.0-6111-pkg1/usr/src/nv/nv_compiler.h
cc -Wp,-MD,/root/tmp/selfgz6313/NVIDIA-Linux-x86-1.0-6111-pkg1/usr/src/nv/
.nv.o.d -nostdinc -isystem /usr/lib/gcc/i586-mandriva-linux-gnu/4.0.1/inclu
de -D__KERNEL__ -Iinclude -Iinclude2 -I/usr/src/linux-2.6.12-12mdk/include
-I/root/tmp/selfgz6313/NVIDIA-Linux-x86-1.0-6111-pkg1/usr/src/nv -Wall -Wstr
ict-prototypes -Wno-trigraphs -fno-strict-aliasing -fno-common -ffreestandin
g -O2 -fno-omit-frame-pointer -pipe -mpreferred-stack-boundary=2 -fno-unit-a
t-a-time -march=i686 -I/usr/src/linux-2.6.12-12mdk/include/asm-i386/mach-def
ault -Iinclude/asm-i386/mach-default -Wdeclaration-after-statement -Wno-poin
ter-sign -I/root/tmp/selfgz6313/NVIDIA-Linux-x86-1.0-6111-pkg1/usr/src/nv -
Wall -Wimplicit -Wreturn-type -Wswitch -Wformat -Wchar-subscripts -Wparenthe
ses -Wpointer-arith -Wno-multichar -Werror -O -fno-common -MD -Wno-cast-qual
-Wno-error -D_LOOSE_KERNEL_NAMES -D__KERNEL__ -DMODULE -DNTRM -D_GNU
_SOURCE -D_LOOSE_KERNEL_NAMES -D__KERNEL__ -DMODULE -DNV_MAJOR_VERSION=1 -DN
V_MINOR_VERSION=0 -DNV_PATCHLEVEL=6111 -DNV_UNIX -DNV_LINUX -DNV_INT64_OK -D
NVCPU_X86 -UDEBUG -U_DEBUG -DNDEBUG -DNV_CHANGE_PAGE_ATTR_PRESENT -DNV_CLASS
_SIMPLE_PRESENT -DMODULE -DKBUILD_BASENAME=nv -DKBUILD_MODNAME=nvidia -c -o /root/tmp/selfgz6313/NVIDIA-Linux-x86-1.0-6111-pkg1/usr/src/nv/nv.o /root/tm
p/selfgz6313/NVIDIA-Linux-x86-1.0-6111-pkg1/usr/src/nv/nv.c
In file included from include/linux/dmapool.h:14,
from include/linux/pci.h:864,
from /root/tmp/selfgz6313/NVIDIA-Linux-x86-1.0-6111-pkg1/us
r/src/nv/nv-linux.h:75,
from /root/tmp/selfgz6313/NVIDIA-Linux-x86-1.0-6111-pkg1/us
r/src/nv/nv.c:14:
include/asm/io.h: In function 'check_signature':
include/asm/io.h:253: warning: wrong type argument to increment
/root/tmp/selfgz6313/NVIDIA-Linux-x86-1.0-6111-pkg1/usr/src/nv/nv.c: In func
tion 'nvos_find_agp_by_class':
/root/tmp/selfgz6313/NVIDIA-Linux-x86-1.0-6111-pkg1/usr/src/nv/nv.c:642: war
ning: implicit declaration of function 'pci_find_class'
/root/tmp/selfgz6313/NVIDIA-Linux-x86-1.0-6111-pkg1/usr/src/nv/nv.c:642: war
ning: assignment makes pointer from integer without a cast
/root/tmp/selfgz6313/NVIDIA-Linux-x86-1.0-6111-pkg1/usr/src/nv/nv.c:653: war
ning: assignment makes pointer from integer without a cast
/root/tmp/selfgz6313/NVIDIA-Linux-x86-1.0-6111-pkg1/usr/src/nv/nv.c: In func
tion 'nvidia_init_module':
/root/tmp/selfgz6313/NVIDIA-Linux-x86-1.0-6111-pkg1/usr/src/nv/nv.c:1161: wa
rning: 'pm_register' is deprecated (declared at include/linux/pm.h:106)
/root/tmp/selfgz6313/NVIDIA-Linux-x86-1.0-6111-pkg1/usr/src/nv/nv.c: In func
tion 'nvidia_exit_module':
/root/tmp/selfgz6313/NVIDIA-Linux-x86-1.0-6111-pkg1/usr/src/nv/nv.c:1279: wa
rning: 'pm_unregister' is deprecated (declared at include/linux/pm.h:111)
/root/tmp/selfgz6313/NVIDIA-Linux-x86-1.0-6111-pkg1/usr/src/nv/nv.c: In func
tion 'nv_kern_mmap':
/root/tmp/selfgz6313/NVIDIA-Linux-x86-1.0-6111-pkg1/usr/src/nv/nv.c:1765: wa
rning: implicit declaration of function 'remap_page_range'
/root/tmp/selfgz6313/NVIDIA-Linux-x86-1.0-6111-pkg1/usr/src/nv/nv.c: In func
tion '_get_phys_address':
/root/tmp/selfgz6313/NVIDIA-Linux-x86-1.0-6111-pkg1/usr/src/nv/nv.c:2731: er
ror: request for member 'pgd' in something not a structure or union
/root/tmp/selfgz6313/NVIDIA-Linux-x86-1.0-6111-pkg1/usr/src/nv/nv.c: In func
tion 'nv_agp_init':
/root/tmp/selfgz6313/NVIDIA-Linux-x86-1.0-6111-pkg1/usr/src/nv/nv.c:3332: wa
rning: implicit declaration of function 'inter_module_get'
/root/tmp/selfgz6313/NVIDIA-Linux-x86-1.0-6111-pkg1/usr/src/nv/nv.c:3333: wa
rning: 'inter_module_put' is deprecated (declared at include/linux/module.h:
568)
/root/tmp/selfgz6313/NVIDIA-Linux-x86-1.0-6111-pkg1/usr/src/nv/nv.c: In func
tion 'nvos_count_devices':
/root/tmp/selfgz6313/NVIDIA-Linux-x86-1.0-6111-pkg1/usr/src/nv/nv.c:3486: wa
rning: assignment makes pointer from integer without a cast
/root/tmp/selfgz6313/NVIDIA-Linux-x86-1.0-6111-pkg1/usr/src/nv/nv.c:3491: wa
rning: assignment makes pointer from integer without a cast
/root/tmp/selfgz6313/NVIDIA-Linux-x86-1.0-6111-pkg1/usr/src/nv/nv.c: In func
tion 'nv_acpi_event':
/root/tmp/selfgz6313/NVIDIA-Linux-x86-1.0-6111-pkg1/usr/src/nv/nv.c:3697: er
ror: 'PM_SAVE_STATE' undeclared (first use in this function)
/root/tmp/selfgz6313/NVIDIA-Linux-x86-1.0-6111-pkg1/usr/src/nv/nv.c:3697: er
ror: (Each undeclared identifier is reported only once
/root/tmp/selfgz6313/NVIDIA-Linux-x86-1.0-6111-pkg1/usr/src/nv/nv.c:3697: er
ror: for each function it appears in.)
make[4]: *** [/root/tmp/selfgz6313/NVIDIA-Linux-x86-1.0-6111-pkg1/usr/src/nv
/nv.o] Erreur 1
make[3]: *** [_module_/root/tmp/selfgz6313/NVIDIA-Linux-x86-1.0-6111-pkg1/us
r/src/nv] Erreur 2
make[2]: *** [modules] Erreur 2
NVIDIA: left KBUILD.
nvidia.ko failed to build!
make[1]: *** [module] Erreur 1
make: *** [module] Erreur 2
-> Error.
ERROR: Unable to build the NVIDIA kernel module.
ERROR: Installation has failed. Please see the file
'/var/log/nvidia-installer.log' for details. You may find suggestions
on fixing installation problems in the README available on the Linux
driver download page at www.nvidia.com.
|
et voila où j'en suis |