Forum |  HardWare.fr | News | Articles | PC | Prix | S'identifier | S'inscrire | Aide | Shop Recherche
1821 connectés 

  FORUM HardWare.fr
  Apple
  Macbook

  Macbook pro late 2011 batterie qui ne charge pas (rapport ADS Apple)

 


 Mot :   Pseudo :  
 
Bas de page
Auteur Sujet :

Macbook pro late 2011 batterie qui ne charge pas (rapport ADS Apple)

n°569808
martel_420
Atypique
Posté le 24-04-2016 à 13:17:23  profilanswer
 

Bonjour,
 
Suite à l'achat d'une nouvelle batterie, celle ci refuse de charger. J'ai le magsafe branché mais la lumière est verte, l'ordinateur fonctionne sur batterie mais impossible de la charger. J'avais le même problème avec mon ancienne batterie.
 
J'ai essayé smc reset, pram reset, rien.  
 
J'ai démonté la carte mère, nettoyé et rien. Pas de liquide renversé dessus..
 
J'ai checké via une vidéo https://www.youtube.com/watch?v=FGYrykiL9rA si cela ne venait pas des composants et non j'ai les bons voltages donc je sèche un peu ..  
 
Merci!
 

Spoiler :

Local machine info: Mac OS X version = 10.6.6(10J3204a) IP Address:127.0.0.1 ASD version:3S148
==========================================================
==========================================================
ASD Log activity from [04/24/16 11:15:00] to [04/24/16 12:10:36]
==========================================================
[04/24/16 11:15:00] * TESTING STARTED *
[04/24/16 11:15:00]  Custom: Hardware Existence Check (test #2) - Hardware Existence Check
  - Verifies non-configurable hardware existance.
[11:15:00]  Test Passed
[04/24/16 11:15:00]  Main Logic Board: Check POST Results (test #1) - Check POST Results
  - Check Results of POST from last reboot.
[11:15:00]  Test Passed
[04/24/16 11:15:00]  Battery: Unconsumed Battery Capacity Test (test #31) - Unconsumed Battery Capacity Test
  - Checks Battery has completed less cycles than design-cycle-count and maximum capacity is greater than 80% of designed capacity.
[11:15:00]  ERROR -- 255 [Unknown result-code 0xff] -- TEST FAILED
[04/24/16 11:15:00] * 1 TEST(S) FAILED * [Elapsed time = 00:00:00]

==========================================================
[04/24/16 11:15:22] * TESTING STARTED *
[04/24/16 11:15:22]  Boot ROM: Boot ROM FW GUID MAC Addr Checksum Test (test #2) - Boot ROM FW GUID MAC Addr Checksum Test
  - Verify the Boot ROM FW GUID MAC address checksum.
[11:15:22]  Test Passed
[04/24/16 11:15:22]  Battery (test #1) - Check Battery Installed
  - Checks for the presence of a battery.
[11:15:22]  Test Passed
[04/24/16 11:15:22]  Battery (test #51) - ATV Table Test
  - Checks to see if the Battery is using the programmed  ATV Table.
[11:15:22]  Test Passed
[04/24/16 11:15:22]  SMC (test #7) - SMC EPM check
  - Check to ensure that UV and CV EPM blocks are programmed.
[11:15:22]  Test Passed
[04/24/16 11:15:22]  SMC (test #1) - SMC PID Sensor check
  - Checks the SMC PID Sensor warning counter that is monitoring sensors of each PID loop for erratic behaviour.
[11:15:22]  Test Passed
[04/24/16 11:15:22]  Display: EDID Checksum Test (test #30) - EDID Checksum Test
  - Calculate EDID checksum
[11:15:22]  Test Passed
[04/24/16 11:15:22]  Temperature (TB0T) -- Battery TS MAX (test #1) - Sensor Reads Within Operating Range (Temperature)
  - Check to ensure that sensor reads within operating range.
[11:15:22]  Test Passed
[04/24/16 11:15:22]  Temperature (TB1T) -- Battery TS 1 (test #1) - Sensor Reads Within Operating Range (Temperature)
  - Check to ensure that sensor reads within operating range.
[11:15:22]  Test Passed
[04/24/16 11:15:22]  Temperature (TB2T) -- Battery TS 2 (test #1) - Sensor Reads Within Operating Range (Temperature)
  - Check to ensure that sensor reads within operating range.
[11:15:22]  Test Passed
[04/24/16 11:15:22]  Temperature (TC0C) -- CPU Die - Digital Core 0 (test #1) - Sensor Reads Within Operating Range (Temperature)
  - Check to ensure that sensor reads within operating range.
[11:15:22]  Test Passed
[04/24/16 11:15:22]  Temperature (TC0D) -- CPU 0 Die Analog (test #1) - Sensor Reads Within Operating Range (Temperature)
  - Check to ensure that sensor reads within operating range.
[11:15:22]  Test Passed
[04/24/16 11:15:22]  Temperature (TC0P) -- CPU Proximity (test #1) - Sensor Reads Within Operating Range (Temperature)
  - Check to ensure that sensor reads within operating range.
[11:15:22]  Test Passed
[04/24/16 11:15:22]  Temperature (TM0P) -- Battery Charger Proximity (test #1) - Sensor Reads Within Operating Range (Temperature)
  - Check to ensure that sensor reads within operating range.
[11:15:22]  Test Passed
[04/24/16 11:15:22]  Temperature (TP0P) -- PCH Proximity (test #1) - Sensor Reads Within Operating Range (Temperature)
  - Check to ensure that sensor reads within operating range.
[11:15:22]  Test Passed
[04/24/16 11:15:22]  Temperature (Th1H) -- Right Fin Stack Proximity (test #1) - Sensor Reads Within Operating Range (Temperature)
  - Check to ensure that sensor reads within operating range.
[11:15:22]  Test Passed
[04/24/16 11:15:22]  Temperature (Ts0P) -- Palm Rest (test #1) - Sensor Reads Within Operating Range (Temperature)
  - Check to ensure that sensor reads within operating range.
[11:15:22]  Test Passed
[04/24/16 11:15:22]  Voltage (VC0C) -- CPU V Core (test #1) - Sensor Reads Within Operating Range (Voltage)
  - Check to ensure that sensor reads within operating range.
[11:15:22]  Test Passed
[04/24/16 11:15:22]  Voltage (VD0R) -- DC in Rail 0 (test #1) - Sensor Reads Within Operating Range (Voltage)
  - Check to ensure that sensor reads within operating range.
[11:15:23]  Test Passed
[04/24/16 11:15:23]  Voltage (VN0R) -- MCP VCore (test #1) - Sensor Reads Within Operating Range (Voltage)
  - Check to ensure that sensor reads within operating range.
[11:15:23]  Test Passed
[04/24/16 11:15:23]  Voltage (VP0R) -- PBus (test #1) - Sensor Reads Within Operating Range (Voltage)
  - Check to ensure that sensor reads within operating range.
[11:15:23]  ERROR -- 2 [Sensor reading above alarm point] -- TEST FAILED

[04/24/16 11:15:23]  Current (IB0r) -- Battery (test #1) - Sensor Reads Within Operating Range (Current)
  - Check to ensure that sensor reads within operating range.
[11:15:23]  Test Passed
[04/24/16 11:15:23]  Current (IC0R) -- Computing (Combined cores) (test #1) - Sensor Reads Within Operating Range (Current)
  - Check to ensure that sensor reads within operating range.
[11:15:23]  Test Passed
[04/24/16 11:15:23]  Current (ID0R) -- DC In (test #1) - Sensor Reads Within Operating Range (Current)
  - Check to ensure that sensor reads within operating range.
[11:15:23]  Test Passed
[04/24/16 11:15:23]  Current (IO0R) -- Other <5V, 3.3V> (test #1) - Sensor Reads Within Operating Range (Current)
  - Check to ensure that sensor reads within operating range.
[11:15:23]  Test Passed
[04/24/16 11:15:23]  Bluetooth (test #1) - USB Interface Test
  - Verifies USB interface between host and Bluetooth module.
[11:15:33]  Test Passed
[04/24/16 11:15:33]  Bluetooth (test #2) - MAC Address Verification Test
  - Verifies the Bluetooth MAC address is not all 00s or all FFs.
[11:15:36]  Test Passed
[04/24/16 11:15:36]  Bluetooth (test #4) - Bluetooth Power Cycle Test
  - Verifies USB interface between host and Bluetooth module after performing a Bluetooth power cycle.
[11:15:47]  Test Passed
[04/24/16 11:15:47]  AirPort (test #1) - MAC Address Verification Test
  - Verifies the AirPort MAC address is not all 00s or all FFs.
[11:15:47]  Test Passed
[04/24/16 11:15:47]  AirPort (test #3) - AirPort Power Cycle Test
  - The test performs an AirPort power off and power on cycle.  It then verifies AirPort by performing wireless scan.
[11:15:54]  Test Passed
[04/24/16 11:15:54]  Product (test #2) - System Serial Number Format Verification Test
  - Verifies that a correctly formatted system serial number has been burned into the unit.
[11:15:54]  Test Passed
[04/24/16 11:15:54]  Product (test #3) - Sleep / Wake Test
  - Verifies that a unit can automatically sleep and wake using the OS sleepx tool.
[11:19:17]  Test Passed
[04/24/16 11:19:17]  Thunderbolt Port (test #1) - ThunderboltPort Interface Test
  - Get port status for each lane on the Thunderbolt port.
[11:19:20]  Test Passed
[04/24/16 11:19:20]  Thunderbolt Port (test #2) - ThunderboltPort Error Register Check Test
  - Read error register on each lane of Thunderbolt port (HEC error register ...).
[11:19:20]  Test Passed
[04/24/16 11:19:20]  Thunderbolt (test #1) - Thunderbolt PCI Interface Test
  - Verify Thunderbolt presence in io registry as a pci device.
[11:19:20]  Test Passed
[04/24/16 11:19:20]  Thunderbolt (test #2) - Thunderbolt Sleep Wake Test
  - Verify Thunderbolt pci interface is maintained over sleep wake cycle.
[11:22:02]  Test Passed
[04/24/16 11:22:02]  Thunderbolt (test #3) - Thunderbolt Error Register Check Test
  - Read error registers and verifies errors within limit.
[11:22:02]  Test Passed
[04/24/16 11:22:02]  Thunderbolt (test #4) - Thunderbolt Internal Loopback Test
  - Enable internal loopback and verifies different patterns of data are sent, received and no mismatch.
[11:22:02]  Test Passed
[04/24/16 11:22:02]  Fan Motor: Exhaust (test #4) - Turn On Automatically
  - System turns on fan motor and verifies fan motor can reach minimum/maximum values
[11:22:31]  Test Passed
[04/24/16 11:22:31]  Quick Fan motor Test (test #5) - Quick Fan motor Test
  - System verifies that the fan motor is running to target speed
[11:22:31]  Test Passed
[04/24/16 11:22:31]  Fan motor Stall Test (test #6) - Fan motor Stall Test
  - System verifies that the fan motor can run above fan motor stall speed
[11:22:31]  Test Passed
[04/24/16 11:22:31]  Ethernet Controller: Built-in (test #1) - MAC Address Verification Test
  - Verifies the Ethernet MAC address is not all 00s or all FFs.
[11:22:31]  Test Passed
[04/24/16 11:22:31]  Ethernet Controller: Built-in (test #10) - MAC Loopback Test
  - Verifies no data mismatch between sent and received while looping within MAC.
[11:22:49]  Test Passed
[04/24/16 11:22:49]  Ethernet Controller: Built-in (test #11) - PHY 1000 Loopback Test
  - Verifies no data mismatch between sent and received while via PHY at 1000 Mbps.
[11:23:06]  Test Passed
[04/24/16 11:23:06]  Ethernet Controller: Built-in (test #12) - PHY 100 Loopback Test
  - Verifies no mismatch between data sent and looped back via PHY at 100 Mbps.
[11:23:30]  Test Passed
[04/24/16 11:23:30]  Ethernet Controller: Built-in (test #13) - PHY 10 Loopback Test
  - Verifies no mismatch between data sent and looped back via PHY at 10 Mbps.
[11:24:00]  Test Passed
[04/24/16 11:24:00]  Ethernet Controller: Built-in (test #20) - Jumbo Packet PHY Loopback Test
  - Verifies no mismatch between data sent and looped back in jumbo packet via PHY at the highest supported speed.
[11:24:38]  Test Passed
[04/24/16 11:24:38]  Video Controller: Built-in (test #2) - OpenGL Point Test
  - Render Points
[11:24:46]  Test Passed
[04/24/16 11:24:46]  Video Controller: Built-in (test #3) - OpenGL Line Test
  - Render Lines
[11:24:53]  Test Passed
[04/24/16 11:24:53]  Video Controller: Built-in (test #4) - OpenGL Triangle Test
  - Render Triangles
[11:24:59]  Test Passed
[04/24/16 11:24:59]  Video Controller: Built-in (test #5) - OpenGL Quad Test
  - Render Quads
[11:25:05]  Test Passed
[04/24/16 11:25:05]  Video Controller: Built-in (test #6) - OpenGL Quad with Texture Test
  - Render Quads with Textures
[11:25:25]  Test Passed
[04/24/16 11:25:25]  Video Controller: Built-in (test #7) - OpenGL Rectangle Test
  - Render Rectangles
[11:25:31]  Test Passed
[04/24/16 11:25:31]  Video Controller: Built-in (test #8) - OpenGL Cube Test
  - Render Cubes
[11:25:38]  Test Passed
[04/24/16 11:25:38]  Video Controller: Built-in (test #9) - OpenGL Cube with Fog Test
  - Render Cube with Fog
[11:25:44]  Test Passed
[04/24/16 11:25:44]  Video Controller: Built-in (test #10) - OpenGL Wireframe Model Test
  - Render Wireframe Model
[11:25:50]  Test Passed
[04/24/16 11:25:50]  Video Controller: Built-in (test #11) - OpenGL Solid Red Model Test
  - Render Solid Red Model
[11:25:57]  Test Passed
[04/24/16 11:25:57]  Video Controller: Built-in (test #12) - OpenGL Solid Red Model with Fog Test
  - Render Solid Red Model with Fog
[11:26:04]  Test Passed
[04/24/16 11:26:04]  Video Controller: Built-in (test #70) - Fragment Instruction Test
  - Tests each instruction of the ARB fragment program instruction by doing calculation and comparing actual against expected
[11:26:37]  Test Passed
[04/24/16 11:26:37]  Video Controller: Built-in (test #72) - Fill Rect 2D Acceleration Test
  - Tests hw accelerated fill rect by filling screen with many rects, calculating checksum, and comparing actual against expected
[11:26:43]  Test Passed
[04/24/16 11:26:43]  Video Controller: Built-in (test #73) - Copy Region 2D Acceleration Test
  - Tests hw accelerated copy region by copying various size of regions many times, calcuating checksum, and comparing actual against expected
[11:26:49]  Test Passed
[04/24/16 11:26:49]  Video Controller: Built-in (test #74) - Copy Rect 2D Acceleration Test
  - Tests hw accelerated copy rect by copying various size of rects many times, calcuating checksum, and comparing actual against expected
[11:26:55]  Test Passed
[04/24/16 11:26:55]  Video Controller: Built-in (test #2) - OpenGL Point Test
  - Render Points
[11:27:01]  Test Passed
[04/24/16 11:27:01]  Video Controller: Built-in (test #3) - OpenGL Line Test
  - Render Lines
[11:27:08]  Test Passed
[04/24/16 11:27:08]  Video Controller: Built-in (test #4) - OpenGL Triangle Test
  - Render Triangles
[11:27:14]  Test Passed
[04/24/16 11:27:14]  Video Controller: Built-in (test #5) - OpenGL Quad Test
  - Render Quads
[11:27:20]  Test Passed
[04/24/16 11:27:20]  Video Controller: Built-in (test #6) - OpenGL Quad with Texture Test
  - Render Quads with Textures
[11:27:26]  Test Passed
[04/24/16 11:27:26]  Video Controller: Built-in (test #7) - OpenGL Rectangle Test
  - Render Rectangles
[11:27:32]  Test Passed
[04/24/16 11:27:33]  Video Controller: Built-in (test #8) - OpenGL Cube Test
  - Render Cubes
[11:27:39]  Test Passed
[04/24/16 11:27:39]  Video Controller: Built-in (test #9) - OpenGL Cube with Fog Test
  - Render Cube with Fog
[11:27:45]  Test Passed
[04/24/16 11:27:45]  Video Controller: Built-in (test #10) - OpenGL Wireframe Model Test
  - Render Wireframe Model
[11:27:51]  Test Passed
[04/24/16 11:27:52]  Video Controller: Built-in (test #11) - OpenGL Solid Red Model Test
  - Render Solid Red Model
[11:27:58]  Test Passed
[04/24/16 11:27:58]  Video Controller: Built-in (test #12) - OpenGL Solid Red Model with Fog Test
  - Render Solid Red Model with Fog
[11:28:05]  Test Passed
[04/24/16 11:28:05]  Video Controller: Built-in (test #70) - Fragment Instruction Test
  - Tests each instruction of the ARB fragment program instruction by doing calculation and comparing actual against expected
[11:28:29]  Test Passed
[04/24/16 11:28:29]  Video Controller: Built-in (test #72) - Fill Rect 2D Acceleration Test
  - "Tests hw accelerated fill rect by filling screen with many rects, calcuating checksum, and comparing actual against expected"#TEST
[11:28:35]  Test Passed
[04/24/16 11:28:35]  Video Controller: Built-in (test #74) - Copy Rect 2D Acceleration Test
  - Tests hw accelerated copy rect by copying various size of rects many times, calcuating checksum, and comparing actual against expected
[11:28:41]  Test Passed
[04/24/16 11:28:41]  Thermal Interface - Processor:Processor0: TIM Test 75 percent GB (test #4) - TIM Test 75 percent GB
  - Check that CPU heatsink is properly attached, using product spec theta dh + 75 percent guardband.
[11:29:08]  ERROR -- 1 [Theta dh too high] -- TEST FAILED

[04/24/16 11:29:08]  Processor: 0 (test #1) - Whetstone Test
  - Concurrent whetstone floating point unit benchmark test
[11:29:40]  Test Passed
[04/24/16 11:29:40]  Processor: 0 (test #2) - Dhrystone Test
  - Concurrent dhrystone integer unit benchmark test
[11:30:15]  Test Passed
[04/24/16 11:30:15]  Processor: 0 (test #3) - Linpack Test
  - Concurrent linpack floating point benchmark test
[11:30:55]  Test Passed
[04/24/16 11:30:55]  Processor: 0 (test #5) - Encoder Test
  - Uses MPEG2 encoder optimized for Intel processor to encode a short video clip twice, and verifies the two results are identical
[11:31:48]  Test Passed
[04/24/16 11:31:48]  Memory (test #10) - Main Memory Self-refresh test
  - Tests Memory before and after a sleep wake cycle testing the memory's self-refresh.
[11:39:47]  Test Passed
[04/24/16 11:39:47]  Memory (test #11) - Main Memory Self-refresh Hibernation Test
  - Tests Memory before and after a hibernate wake cycle testing the memory's self-refresh.
[11:44:43]  Test Passed
[04/24/16 11:44:44]  Memory (test #30) - Apple 64 Memory Address As Data test
  - Perform Apple simple memory test task under 64-bits environment.
[11:49:00]  Test Passed
[04/24/16 11:49:01]  Memory (test #31) - Apple 64 Memory Random Pattern test
  - Perform Apple simple memory test task under 64-bits environment.
[11:49:53]  Test Passed
[04/24/16 11:49:54]  Memory (test #32) - Apple 64 Memory Sequential Increment test
  - Perform Apple simple memory test task under 64-bits environment.
[11:50:20]  Test Passed
[04/24/16 11:50:21]  Memory (test #33) - Apple 64 Memory Block Checkerboard test
  - Perform Apple simple memory test task under 64-bits environment.
[11:52:01]  Test Passed
[04/24/16 11:52:02]  Memory (test #34) - Apple 64 Memory Bit Checkerboard test
  - Perform Apple simple memory test task under 64-bits environment.
[11:53:13]  Test Passed
[04/24/16 11:53:14]  Memory (test #35) - Apple 64 Memory Sequential Byte Block test
  - Perform Apple simple memory test task under 64-bits environment.
[11:58:29]  Test Passed
[04/24/16 11:58:29]  Memory (test #36) - Apple 64 Memory Walking Ones test
  - Perform Apple simple memory test task under 64-bits environment.
[12:02:33]  Test Passed
[04/24/16 12:02:34]  Memory (test #37) - Apple 64 Memory Walking Zeros test
  - Perform Apple simple memory test task under 64-bits environment.
[12:05:07]  Test Passed
[04/24/16 12:05:07]  Memory (test #38) - Apple 64 Memory Walking Spread Bits test
  - Perform Apple simple memory test task under 64-bits environment.
[12:08:07]  Test Passed
[04/24/16 12:08:07]  Memory (test #39) - Apple 64 Memory Walking Bit Flip test
  - Perform Apple simple memory test task under 64-bits environment.
[12:10:35]  Test Passed
[04/24/16 12:10:35]  Hard Drive - Internal: Check SMART status (test #5) - Check SMART status
  - Check the SMART status of a device.
[12:10:36]  ERROR - -33000 [Wrong drive type.] -- TEST FAILED
[04/24/16 12:10:36] * 3 TEST(S) FAILED * [Elapsed time = 00:55:13]


Message édité par martel_420 le 24-04-2016 à 21:40:01
mood
Publicité
Posté le 24-04-2016 à 13:17:23  profilanswer
 

n°569851
martel_420
Atypique
Posté le 24-04-2016 à 15:52:11  profilanswer
 

:bounce:

n°569917
martel_420
Atypique
Posté le 24-04-2016 à 21:33:13  profilanswer
 

:bounce:

n°569929
martel_420
Atypique
Posté le 25-04-2016 à 09:26:50  profilanswer
 

:bounce:

n°578307
soros16
Posté le 19-07-2016 à 19:34:38  profilanswer
 

C'est quel model de Macbook? model de carte mere: 820 xxxx?
Tu as les schemas?
donne plus d'info
 


Aller à :
Ajouter une réponse
  FORUM HardWare.fr
  Apple
  Macbook

  Macbook pro late 2011 batterie qui ne charge pas (rapport ADS Apple)

 

Sujets relatifs
[ACH] acheter une batterie iphone 5 de qualitéMac Pro Late 2013 - satisfait
Bande de couleur négative sur macbook pro rétina.Problème HDMI entre Macbook Pro et TV 4K
aide pour lire des videos d'un DD PC sur un macbook proiPhone comportement bizarre ! Se décharge et ne se charge plus.
[résolu] kernel_task 300% sur macbook pro late 2011MacBook Pro retina 13" et Multi Screen
Plus de sujets relatifs à : Macbook pro late 2011 batterie qui ne charge pas (rapport ADS Apple)



Copyright © 1997-2016 Hardware.fr SARL (Signaler un contenu illicite) / Groupe LDLC / Shop HFR